Search Options

Results per page
Sort
Preferred Languages
Labels
Advance

Results 1 - 10 of 136 for undefined (0.43 sec)

  1. Linker error: undefined reference to upm::Jhd13...

    Linker error: undefined reference to upm::Jhd1313m1 I am new...file this error come to me undefined reference to upm::Jhd1313m1...
    discuss.96boards.org/t/linker-error-undefined-r...
    Registered: 2020-10-21 21:55
    - 30.2K bytes
    - Viewed (0)
  2. 410c Android - "undefined abort, halting"

    410c Android - "undefined abort, halting" Hi, I tried installing...bootup aborts saying "[480] undefined abort, halting" Serial console:...
    discuss.96boards.org/t/410c-android-undefined-a...
    Registered: 2020-10-22 06:27
    - 8.6K bytes
    - Viewed (0)
  3. Failed to build edk2: undefined reference to `_...

    Failed to build edk2: undefined reference to `__stack_chk_guard'...ormPkg/PrePi/PrePi.c:55: undefined reference to `__stack_chk_guard'...
    discuss.96boards.org/t/failed-to-build-edk2-und...
    Registered: 2020-10-21 17:22
    - 63.5K bytes
    - Viewed (0)
  4. AOSP build error- ld.lld: error: undefined symb...

    lld: error: undefined symbol: v8::internal I am...-Wl,--fatal-warnings -Wl,--no-undefined-version -Wl,--exclude-libs,libgcc.a...
    discuss.96boards.org/t/aosp-build-error-ld-lld-...
    Registered: 2020-10-21 21:36
    - 24.5K bytes
    - Viewed (0)
  5. BKK16-503: Undefined Behavior and Compiler Opti...

    BKK16-503: Undefined Behavior and Compiler Optimizations – Why...Compilers such as GCC may use undefined behaviour in language specifications...
    connect.linaro.org/resources/bkk16/bkk16-503/ Cache
    Registered: 2020-10-21 02:46
    - Last Modified: 2020-10-20 08:17
    - 26.7K bytes
    - Viewed (0)
  6. Framework machine learning error

    "kernel_net_tests" depends on undefined module "scapy" error: fra..."libnnbenchmark" depends on undefined module "libtflite_static"...
    discuss.96boards.org/t/framework-machine-learni...
    Registered: 2020-10-21 22:21
    - 3.6K bytes
    - Viewed (0)
  7. Modifying a exiting aosp app

    --no-undefined-version -Wl,-m,aarch64_elf64_le_vec...rch64-android.a -Wl,--no-undefined out/target/product/hikey9...
    discuss.96boards.org/t/modifying-a-exiting-aosp...
    Registered: 2020-10-21 04:50
    - 23.1K bytes
    - Viewed (0)
  8. How to use NPU on Debian?

    so: undefined reference to `vendor::hua..../lib64/libai_client.so: undefined reference to `vendor::hua...
    discuss.96boards.org/t/how-to-use-npu-on-debian...
    Registered: 2020-10-21 22:03
    - 10K bytes
    - Viewed (0)
  9. Build Failed. Clang Error,

    android::VectorImpl: error: undefined reference to 'vtable for ...for ClassElement: error: undefined reference to '__cxa_pure_virtual'...
    discuss.96boards.org/t/build-failed-clang-error...
    Registered: 2020-10-21 16:52
    - 9.2K bytes
    - Viewed (0)
  10. Hikey960 AOSP build failed

    “kernel_net_tests” depends on undefined module "scapy" error: fra...“libnnbenchmark” depends on undefined module "libtflite_static"...
    discuss.96boards.org/t/hikey960-aosp-build-fail...
    Registered: 2020-10-22 08:35
    - 11.1K bytes
    - Viewed (0)
Back to top