Search Options

Results per page
Sort
Preferred Languages
Labels
Advance

Results 1 - 10 of 74 for undefined (0.71 sec)

  1. Latest HiKey970 topics - 96Boards Forum

    2020 Failed to build edk2: undefined reference to `__stack_chk_guard'...
    discuss.96boards.org/c/products/hikey970/32 Cache
    Registered: 2021-08-01 00:02
    - 61.1K bytes
    - Viewed (1)
  2. Linker error: undefined reference to upm::Jhd13...

    Blog Forums Linker error: undefined reference to upm::Jhd1313m1...file this error come to me undefined reference to upm::Jhd1313m1...
    discuss.96boards.org/t/linker-error-undefined-r... Cache
    Registered: 2021-06-06 14:22
    - Last Modified: 2019-10-03 08:12
    - 54.5K bytes
    - Viewed (4)
  3. 410c Android - "undefined abort, halting" - Dra...

    Blog Forums 410c Android - "undefined abort, halting" Products Support...bootup aborts saying “[480] undefined abort, halting” Serial console:...
    discuss.96boards.org/t/410c-android-undefined-a... Cache
    Registered: 2021-06-06 04:48
    - Last Modified: 2017-02-20 09:23
    - 19K bytes
    - Viewed (0)
  4. BKK16-503: Undefined Behavior and Compiler Opti...

    BKK16-503: Undefined Behavior and Compiler Optimizations – Why...Compilers such as GCC may use undefined behaviour in language specifications...
    connect.linaro.org/resources/bkk16/bkk16-503/ Cache
    Registered: 2021-07-16 03:02
    - Last Modified: 2021-07-15 17:19
    - 29.9K bytes
    - Viewed (0)
  5. Failed to build edk2: undefined reference to `_...

    Forums Failed to build edk2: undefined reference to `__stack_chk_guard'...ormPkg/PrePi/PrePi.c:55: undefined reference to `__stack_chk_guard'...
    discuss.96boards.org/t/failed-to-build-edk2-und... Cache
    Registered: 2021-06-06 04:03
    - Last Modified: 2020-07-23 13:24
    - 43.7K bytes
    - Viewed (0)
  6. AOSP build error- ld.lld: error: undefined symb...

    lld: error: undefined symbol: v8::internal Products...-Wl,--fatal-warnings -Wl,--no-undefined-version -Wl,--exclude-libs,libgcc.a...
    discuss.96boards.org/t/aosp-build-error-ld-lld-... Cache
    Registered: 2021-06-06 13:52
    - Last Modified: 2019-07-30 04:07
    - 25.3K bytes
    - Viewed (0)
  7. Build kernel image for dragon board - DragonBoa...

    ko] undefined! ERROR: “cpu_tss” [fs/nfsd/nfsd.ko]...[fs/nfsd/nfsd.ko] undefined! ERROR: “current_task” [fs/nfsd/nfsd.ko]...
    discuss.96boards.org/t/build-kernel-image-for-d... Cache
    Registered: 2021-06-06 10:24
    - Last Modified: 2018-05-01 13:09
    - 78.8K bytes
    - Viewed (0)
  8. Not Able to build Kernel ? Clang Linker error -...

    android::VectorImpl: error: undefined reference to ‘vtable for ...for ClassElement: error: undefined reference to ‘__cxa_pure_virtual’...
    discuss.96boards.org/t/not-able-to-build-kernel... Cache
    Registered: 2021-06-06 11:02
    - Last Modified: 2018-07-13 13:32
    - 45.6K bytes
    - Viewed (0)
  9. Framework machine learning error - HiKey 960 - ...

    “kernel_net_tests” depends on undefined module "scapy" error: fra...“libnnbenchmark” depends on undefined module "libtflite_static"...
    discuss.96boards.org/t/framework-machine-learni... Cache
    Registered: 2021-06-06 09:42
    - Last Modified: 2018-02-13 05:36
    - 12.2K bytes
    - Viewed (0)
  10. Interfacing I2C Grove Digital Light Sensor on D...

    text+0xedc): undefined reference to stdscr' menu...menubox.c:(.text+0x10a9): undefined reference to wbkgdset’ menub...
    discuss.96boards.org/t/interfacing-i2c-grove-di... Cache
    Registered: 2021-06-06 06:16
    - Last Modified: 2017-02-20 09:27
    - 33.4K bytes
    - Viewed (1)
Back to top