Search Options

Results per page
Sort
Preferred Languages
Labels
Advance

Results 1 - 10 of 46 for undefined (1.37 sec)

  1. Latest HiKey970 topics - 96Boards Forum

    2020 Failed to build edk2: undefined reference to `__stack_chk_guard'...
    discuss.96boards.org/c/products/hikey970/32 Cache
    Registered: 2021-09-25 00:22
    - 60.3K bytes
    - Viewed (1)
  2. Not Able to build Kernel ? Clang Linker error -...

    android::VectorImpl: error: undefined reference to ‘vtable for ...for ClassElement: error: undefined reference to ‘__cxa_pure_virtual’...
    discuss.96boards.org/t/not-able-to-build-kernel... Cache
    Registered: 2021-06-06 11:02
    - Last Modified: 2018-07-13 13:32
    - 45.6K bytes
    - Viewed (0)
  3. Hikey960 build error - 96Boards Forum

    “libvndksupport” depends on undefined module “libdl_android” 10:39:37...
    discuss.96boards.org/t/hikey960-build-error/7778 Cache
    Registered: 2021-06-06 13:11
    - Last Modified: 2019-04-09 09:18
    - 18.5K bytes
    - Viewed (0)
  4. Debian boot hangs after OP-TEE flash and system...

    an error while compiling undefined reference to __getrlimit@glibc_private...warn users regarding this. undefined reference to __getrlimit@glibc_private...
    discuss.96boards.org/t/debian-boot-hangs-after-... Cache
    Registered: 2021-06-06 06:23
    - Last Modified: 2017-02-20 09:27
    - 45.3K bytes
    - Viewed (0)
  5. Android build not working - DragonBoard410c - 9...

    tree @ 0x81e00000 [23400] undefined abort, halting [23400] r0...
    discuss.96boards.org/t/android-build-not-workin... Cache
    Registered: 2021-06-06 05:48
    - Last Modified: 2017-02-20 09:26
    - 25.3K bytes
    - Viewed (0)
  6. Linker error: undefined reference to upm::Jhd13...

    Blog Forums Linker error: undefined reference to upm::Jhd1313m1...file this error come to me undefined reference to upm::Jhd1313m1...
    discuss.96boards.org/t/linker-error-undefined-r... Cache
    Registered: 2021-06-06 14:22
    - Last Modified: 2019-10-03 08:12
    - 54.5K bytes
    - Viewed (4)
  7. Failed to build edk2: undefined reference to `_...

    Forums Failed to build edk2: undefined reference to `__stack_chk_guard'...ormPkg/PrePi/PrePi.c:55: undefined reference to `__stack_chk_guard'...
    discuss.96boards.org/t/failed-to-build-edk2-und... Cache
    Registered: 2021-06-06 04:03
    - Last Modified: 2020-07-23 13:24
    - 43.7K bytes
    - Viewed (0)
  8. AOSP build error- ld.lld: error: undefined symb...

    lld: error: undefined symbol: v8::internal Products...-Wl,--fatal-warnings -Wl,--no-undefined-version -Wl,--exclude-libs,libgcc.a...
    discuss.96boards.org/t/aosp-build-error-ld-lld-... Cache
    Registered: 2021-06-06 13:52
    - Last Modified: 2019-07-30 04:07
    - 25.3K bytes
    - Viewed (0)
  9. How to use NPU on Debian? - HiKey970 - 96Boards...

    so: undefined reference to `vendor::hua..../lib64/libai_client.so: undefined reference to `vendor::hua...
    discuss.96boards.org/t/how-to-use-npu-on-debian... Cache
    Registered: 2021-06-06 11:14
    - Last Modified: 2018-08-10 13:24
    - 20.8K bytes
    - Viewed (0)
  10. Cross-Compiling Qt - DragonBoard410c - 96Boards...

    c:727: error: undefined reference to 'VP8DspInitNEON’...rc/dsp/enc.c:736: error: undefined reference to 'VP8EncDspInitNEON’...
    discuss.96boards.org/t/cross-compiling-qt/836 Cache
    Registered: 2021-06-06 07:22
    - Last Modified: 2017-03-12 08:10
    - 14.1K bytes
    - Viewed (0)
Back to top