Search Options

Results per page
Sort
Preferred Languages
Labels
Advance

Results 11 - 20 of 46 for undefined (0.67 sec)

  1. Cross compilation tools - MediaTek-X20 - 96Boar...

    –no-undefined -ldl main: $(CC) $(INCLUDE)...
    discuss.96boards.org/t/cross-compilation-tools/... Cache
    Registered: 2021-06-06 07:24
    - Last Modified: 2017-03-15 11:08
    - 26.6K bytes
    - Viewed (0)
  2. Hexagon SDK support for Dragonboard 820c - Drag...

    dlopen error: hexagon_nn undefined PLT symbol #39 HAP_mem_set_grow_size...
    discuss.96boards.org/t/hexagon-sdk-support-for-... Cache
    Registered: 2021-06-06 15:38
    - Last Modified: 2019-07-05 06:56
    - 57.7K bytes
    - Viewed (0)
  3. 410c Android - "undefined abort, halting" - Dra...

    Blog Forums 410c Android - "undefined abort, halting" Products Support...bootup aborts saying “[480] undefined abort, halting” Serial console:...
    discuss.96boards.org/t/410c-android-undefined-a... Cache
    Registered: 2021-06-06 04:48
    - Last Modified: 2017-02-20 09:23
    - 19K bytes
    - Viewed (0)
  4. Not Able to build Kernel ? Clang Linker error -...

    android::VectorImpl: error: undefined reference to ‘vtable for ...for ClassElement: error: undefined reference to ‘__cxa_pure_virtual’...
    discuss.96boards.org/t/not-able-to-build-kernel... Cache
    Registered: 2021-06-06 11:02
    - Last Modified: 2018-07-13 13:32
    - 45.6K bytes
    - Viewed (0)
  5. Modifying a exiting aosp app - HiKey 960 - 96Bo...

    --no-undefined-version -Wl,-m,aarch64_elf64_le_vec...rch64-android.a -Wl,--no-undefined out/target/product/hikey9...
    discuss.96boards.org/t/modifying-a-exiting-aosp... Cache
    Registered: 2021-06-06 15:36
    - Last Modified: 2020-07-06 15:29
    - 40.3K bytes
    - Viewed (0)
  6. Build Failed. Clang Error, - MediaTek-X20 - 96B...

    android::VectorImpl: error: undefined reference to ‘vtable for ...for ClassElement: error: undefined reference to ‘__cxa_pure_virtual’...
    discuss.96boards.org/t/build-failed-clang-error... Cache
    Registered: 2021-06-06 10:57
    - Last Modified: 2018-07-05 16:02
    - 18.4K bytes
    - Viewed (0)
  7. Hikey960 build error - 96Boards Forum

    “libvndksupport” depends on undefined module “libdl_android” 10:39:37...
    discuss.96boards.org/t/hikey960-build-error/7778 Cache
    Registered: 2021-06-06 13:11
    - Last Modified: 2019-04-09 09:18
    - 18.5K bytes
    - Viewed (0)
  8. Debian boot hangs after OP-TEE flash and system...

    an error while compiling undefined reference to __getrlimit@glibc_private...warn users regarding this. undefined reference to __getrlimit@glibc_private...
    discuss.96boards.org/t/debian-boot-hangs-after-... Cache
    Registered: 2021-06-06 06:23
    - Last Modified: 2017-02-20 09:27
    - 45.3K bytes
    - Viewed (0)
  9. Ufs-bsg support in Debian - HiKey 960 - 96Board...

    c:294: undefined reference to usb_role_switch_unregister’...R_AARCH64_CALL26 against undefined symbol usb_role_switch_unregister'...
    discuss.96boards.org/t/ufs-bsg-support-in-debia... Cache
    Registered: 2021-06-06 14:35
    - Last Modified: 2019-11-05 10:46
    - 13.1K bytes
    - Viewed (0)
  10. Android build not working - DragonBoard410c - 9...

    tree @ 0x81e00000 [23400] undefined abort, halting [23400] r0...
    discuss.96boards.org/t/android-build-not-workin... Cache
    Registered: 2021-06-06 05:48
    - Last Modified: 2017-02-20 09:26
    - 25.3K bytes
    - Viewed (0)
Back to top