Search Options

Results per page
Sort
Preferred Languages
Labels
Advance

Results 1 - 10 of 50 for undefined (1.32 sec)

  1. Linker error: undefined reference to upm::Jhd13...

    Blog Forums Linker error: undefined reference to upm::Jhd1313m1...file this error come to me undefined reference to upm::Jhd1313m1...
    discuss.96boards.org/t/linker-error-undefined-r... Cache
    Registered: 2024-07-12 12:07
    - Last Modified: 2019-10-03 08:12
    - 55.6K bytes
    - Viewed (6)
  2. Failed to build edk2: undefined reference to `_...

    Forums Failed to build edk2: undefined reference to `__stack_chk_guard'...ormPkg/PrePi/PrePi.c:55: undefined reference to `__stack_chk_guard'...
    discuss.96boards.org/t/failed-to-build-edk2-und... Cache
    Registered: 2024-07-13 01:16
    - Last Modified: 2020-07-23 13:24
    - 43.6K bytes
    - Viewed (6)
  3. 410c Android - "undefined abort, halting" - Dra...

    Blog Forums 410c Android - "undefined abort, halting" Products Support...bootup aborts saying “[480] undefined abort, halting” Serial console:...
    discuss.96boards.org/t/410c-android-undefined-a... Cache
    Registered: 2024-07-13 02:53
    - Last Modified: 2017-02-20 09:23
    - 18.9K bytes
    - Viewed (1)
  4. AOSP build error- ld.lld: error: undefined symb...

    lld: error: undefined symbol: v8::internal Products...-Wl,--fatal-warnings -Wl,--no-undefined-version -Wl,--exclude-libs,libgcc.a...
    discuss.96boards.org/t/aosp-build-error-ld-lld-... Cache
    Registered: 2024-07-12 11:40
    - Last Modified: 2019-07-30 04:07
    - 25.2K bytes
    - Viewed (1)
  5. How to use NPU on Debian? - HiKey970 - 96Boards...

    so: undefined reference to `vendor::hua..../lib64/libai_client.so: undefined reference to `vendor::hua...
    discuss.96boards.org/t/how-to-use-npu-on-debian... Cache
    Registered: 2024-07-12 09:08
    - Last Modified: 2018-08-10 13:24
    - 20.6K bytes
    - Viewed (0)
  6. Not Able to build Kernel ? Clang Linker error -...

    android::VectorImpl: error: undefined reference to ‘vtable for ...for ClassElement: error: undefined reference to ‘__cxa_pure_virtual’...
    discuss.96boards.org/t/not-able-to-build-kernel... Cache
    Registered: 2024-07-13 02:14
    - Last Modified: 2018-07-13 13:32
    - 46.1K bytes
    - Viewed (1)
  7. Build kernel image for dragon board - DragonBoa...

    ko] undefined! ERROR: “cpu_tss” [fs/nfsd/nfsd.ko]...[fs/nfsd/nfsd.ko] undefined! ERROR: “current_task” [fs/nfsd/nfsd.ko]...
    discuss.96boards.org/t/build-kernel-image-for-d... Cache
    Registered: 2024-07-12 08:21
    - Last Modified: 2018-05-01 13:09
    - 79.7K bytes
    - Viewed (0)
  8. Build errors for Avenger96 board with Arm Trust...

    c:181: undefined reference to `__stack_chk_fail'...lib/psci/psci_off.c:181: undefined reference to `__stack_chk_guard'...
    discuss.96boards.org/t/build-errors-for-avenger... Cache
    Registered: 2024-07-13 01:57
    - Last Modified: 2021-12-28 22:01
    - 15.3K bytes
    - Viewed (2)
  9. Cross-Compiling Qt - DragonBoard410c - 96Boards...

    c:727: error: undefined reference to ‘VP8DspInitNEON’...rc/dsp/enc.c:736: error: undefined reference to ‘VP8EncDspInitNEON’...
    discuss.96boards.org/t/cross-compiling-qt/836 Cache
    Registered: 2024-07-12 05:22
    - Last Modified: 2017-03-12 08:10
    - 13.9K bytes
    - Viewed (0)
  10. Hikey960 AOSP build failed - HiKey - 96Boards F...

    “kernel_net_tests” depends on undefined module “scapy” error: fra...“libnnbenchmark” depends on undefined module “libtflite_static”...
    discuss.96boards.org/t/hikey960-aosp-build-fail... Cache
    Registered: 2024-07-12 08:49
    - Last Modified: 2018-02-21 09:18
    - 32.3K bytes
    - Viewed (0)
Back to top