Search Options

Results per page
Sort
Preferred Languages
Labels
Advance

Results 11 - 20 of 74 for undefined (0.52 sec)

  1. Interfacing I2C Grove Digital Light Sensor on D...

    text+0xedc): undefined reference to stdscr' menu...menubox.c:(.text+0x10a9): undefined reference to wbkgdset’ menub...
    discuss.96boards.org/t/interfacing-i2c-grove-di... Cache
    Registered: 2021-06-06 06:16
    - Last Modified: 2017-02-20 09:27
    - 33.4K bytes
    - Viewed (1)
  2. How to use NPU on Debian? - HiKey970 - 96Boards...

    so: undefined reference to `vendor::hua..../lib64/libai_client.so: undefined reference to `vendor::hua...
    discuss.96boards.org/t/how-to-use-npu-on-debian... Cache
    Registered: 2021-06-06 11:14
    - Last Modified: 2018-08-10 13:24
    - 20.8K bytes
    - Viewed (0)
  3. Build Failed. Clang Error, - MediaTek-X20 - 96B...

    android::VectorImpl: error: undefined reference to ‘vtable for ...for ClassElement: error: undefined reference to ‘__cxa_pure_virtual’...
    discuss.96boards.org/t/build-failed-clang-error... Cache
    Registered: 2021-06-06 10:57
    - Last Modified: 2018-07-05 16:02
    - 18.4K bytes
    - Viewed (0)
  4. Python and Go in the Arm World - Linaro

    the behavior is undefined. 50) The first part of the...integer type, the behaviour is undefined. This means that if a negative...
    www.linaro.org/blog/python-and-go-in-the-arm-wo... Cache
    Registered: 2021-09-15 04:06
    - Last Modified: 2021-09-14 11:05
    - 24.8K bytes
    - Viewed (0)
  5. Cross-Compiling Qt - DragonBoard410c - 96Boards...

    c:727: error: undefined reference to 'VP8DspInitNEON’...rc/dsp/enc.c:736: error: undefined reference to 'VP8EncDspInitNEON’...
    discuss.96boards.org/t/cross-compiling-qt/836 Cache
    Registered: 2021-06-06 07:22
    - Last Modified: 2017-03-12 08:10
    - 14.1K bytes
    - Viewed (0)
  6. Hikey960 AOSP build failed - HiKey - 96Boards F...

    “kernel_net_tests” depends on undefined module "scapy" error: fra...“libnnbenchmark” depends on undefined module "libtflite_static"...
    discuss.96boards.org/t/hikey960-aosp-build-fail... Cache
    Registered: 2021-06-06 10:55
    - Last Modified: 2018-02-21 09:18
    - 32.3K bytes
    - Viewed (0)
  7. Build Tensorflow on Bubblegum-96 - Bubblegum-96...

    tensorflow5mutex]+0x10): undefined reference to nsync::nsync...tensorflow5mutex]+0x10): undefined reference to nsync::nsync...
    discuss.96boards.org/t/build-tensorflow-on-bubb... Cache
    Registered: 2021-06-06 03:12
    - Last Modified: 2017-10-09 11:06
    - 13.1K bytes
    - Viewed (0)
  8. Ufs-bsg support in Debian - HiKey 960 - 96Board...

    c:294: undefined reference to usb_role_switch_unregister’...R_AARCH64_CALL26 against undefined symbol usb_role_switch_unregister'...
    discuss.96boards.org/t/ufs-bsg-support-in-debia... Cache
    Registered: 2021-06-06 14:35
    - Last Modified: 2019-11-05 10:46
    - 13.1K bytes
    - Viewed (0)
  9. Need help with configuring Android.mk file ( AO...

    c:19: undefined reference to'TEEC_In...DKTest/jni/ndktest.c:27: undefined reference to 'TEEC_OpenSession'...
    discuss.96boards.org/t/need-help-with-configuri... Cache
    Registered: 2021-06-06 03:41
    - Last Modified: 2020-06-17 20:34
    - 32.3K bytes
    - Viewed (0)
  10. Error while building Oreo for 624_sbc - off_top...

    “libnfc-nci” depends on undefined module “libpower” [2/2] soong_build... “libnfc-nci” depends on undefined module "libpower" ninja: build...
    discuss.96boards.org/t/error-while-building-ore... Cache
    Registered: 2021-06-06 10:13
    - Last Modified: 2018-04-16 10:04
    - 20.8K bytes
    - Viewed (0)
Back to top